Target
Metabotropic glutamate receptor 5
Ligand
BDBM50177088
Substrate
Meas. Tech.
ChEMBL_430992 (CHEMBL916420)
IC50
>100000±n/a nM
Citation
 Zheng, GZBhatia, PDaanen, JKolasa, TPatel, MLatshaw, SEl Kouhen, OFChang, RUchic, MEMiller, LNakane, MLehto, SGHonore, MPMoreland, RBBrioni, JDStewart, AO Structure-activity relationship of triazafluorenone derivatives as potent and selective mGluR1 antagonists. J Med Chem 48:7374-88 (2005)  
Target
Name:
Metabotropic glutamate receptor 5
Synonyms:
GPRC1E GRM5_HUMAN metabotropic glutamate 5 | metabotropic glutamate 5a
Type:
Enzyme
Mol. Mass.:
132484.72
Organism:
Homo sapiens (Human)
Description:
Residue:
1212
  
Inhibitor
Name:
BDBM50177088
Synonyms:
9-dimethylamino-3-(4'-ethylphenyl)-3H-1,3,6-triazafluoren-4-one | CHEMBL224377
Type:
Small organic molecule
Emp. Form.:
C19H18N4O2
Mol. Mass.:
334.3718
SMILES:
CCc1ccc(cc1)-n1cnc2c(oc3nccc(N(C)C)c23)c1=O
: