Target
Amine oxidase [flavin-containing] B
Ligand
BDBM67454
Substrate
Meas. Tech.
ChEMBL_2231111 (CHEMBL5144883)
IC50
40200±n/a nM
Citation
 Lefin, RPetzer, APetzer, JP Phenothiazine, anthraquinone and related tricyclic derivatives as inhibitors of monoamine oxidase. Bioorg Med Chem 54:0 (2022) Target
Name:
Amine oxidase [flavin-containing] B
Synonyms:
AOFB_HUMAN MAOB Monoamine oxidase type B (MAO B) Monoamine oxidase type B (MAOB)
Type:
Protein
Mol. Mass.:
58768.76
Organism:
Homo sapiens (Human)
Description:
P27338
Residue:
520
  
Inhibitor
Name:
BDBM67454
Synonyms:
1,2,4-trihydroxy-9,10-anthraquinone 1,2,4-tris(oxidanyl)anthracene-9,10-dione SMR001306802 hsp90_173 | purpurin
Type:
Small organic molecule
Emp. Form.:
C14H8O5
Mol. Mass.:
256.2103
SMILES:
Oc1cc(O)c2C(=O)c3ccccc3C(=O)c2c1O
: