Target
Lysophosphatidic acid receptor 3
Ligand
BDBM50177332
Substrate
Meas. Tech.
ChEMBL_329846 (CHEMBL862795)
EC50
639±n/a nM
Citation
 Gududuru, VZeng, KTsukahara, RMakarova, NFujiwara, YPigg, KRBaker, DLTigyi, GMiller, DD Identification of Darmstoff analogs as selective agonists and antagonists of lysophosphatidic acid receptors. Bioorg Med Chem Lett 16:451-6 (2005)  
Target
Name:
Lysophosphatidic acid receptor 3
Synonyms:
Edg7 Lpa3 Lysophosphatidic acid receptor 1/lysophosphatidic acid receptor 3 | Lysophosphatidic acid receptor Edg-7
Type:
PROTEIN
Mol. Mass.:
40307.81
Organism:
Rattus norvegicus
Description:
ChEMBL_329846
Residue:
354
  
Inhibitor
Name:
BDBM50177332
Synonyms:
CHEMBL199472 | potassium O-(2-(heptadec-9-enyl)-1,3-dioxolan-4-yl)methyl O-hydrogenphosphorothioate
Type:
Small organic molecule
Emp. Form.:
C21H40O5PS
Mol. Mass.:
435.579
SMILES:
CCCCCCC\C=C\CCCCCCCCC1OCC(COP(O)([O-])=S)O1
: