Target
Lysophosphatidic acid receptor 3
Ligand
BDBM50177338
Substrate
Meas. Tech.
ChEMBL_329846 (CHEMBL862795)
EC50
7590±n/a nM
Citation
 Gududuru, VZeng, KTsukahara, RMakarova, NFujiwara, YPigg, KRBaker, DLTigyi, GMiller, DD Identification of Darmstoff analogs as selective agonists and antagonists of lysophosphatidic acid receptors. Bioorg Med Chem Lett 16:451-6 (2005)  
Target
Name:
Lysophosphatidic acid receptor 3
Synonyms:
Edg7 Lpa3 Lysophosphatidic acid receptor 1/lysophosphatidic acid receptor 3 | Lysophosphatidic acid receptor Edg-7
Type:
PROTEIN
Mol. Mass.:
40307.81
Organism:
Rattus norvegicus
Description:
ChEMBL_329846
Residue:
354
  
Inhibitor
Name:
BDBM50177338
Synonyms:
CHEMBL383362 | potassium (2-(heptadeca-9,12,15-trienyl)-1,3-dioxolan-4-yl)methyl hydrogenphosphate
Type:
Small organic molecule
Emp. Form.:
C21H36O6P
Mol. Mass.:
415.4813
SMILES:
C\C=C\C\C=C\C\C=C\CCCCCCCCC1OCC(COP(O)([O-])=O)O1
: