Target
Acetyl-CoA acetyltransferase, mitochondrial
Ligand
BDBM50599923
Substrate
Meas. Tech.
ChEMBL_2232164 (CHEMBL5145936)
IC50
2500±n/a nM
Citation
 Koul, SKurhade, SBhosale, SNaik, KSalunkhe, VRavula, SPunde, PVelayutham, RTiwari, AAhl, DMalkapuram, SMudagala, VRaje, AUmrani, DTambe, SPatil, PSingh, UBhuniya, DHariharan, NMookhtiar, K Design and synthesis of novel spirocyclic carboxylic acids as potent and orally bioavailable DGAT1 inhibitors and their biological evaluation. Bioorg Med Chem Lett 62:0 (2022) Target
Name:
Acetyl-CoA acetyltransferase, mitochondrial
Synonyms:
2.3.1.9 ACAT1 MAT | THIL_HUMAN
Type:
PROTEIN
Mol. Mass.:
45208.64
Organism:
Homo sapiens
Description:
ChEMBL_12700
Residue:
427
  
Inhibitor
Name:
BDBM50599923
Synonyms:
CHEMBL5204128
Type:
Small organic molecule
Emp. Form.:
C23H22F2N6O4
Mol. Mass.:
484.4554
SMILES:
OC(=O)C1CC2(C1)CCN(CC2)c1ccc(NC(=O)c2nnc(Nc3ccc(F)c(F)c3)o2)cn1
: