Target
Thyroid hormone receptor alpha
Ligand
BDBM50178975
Substrate
Meas. Tech.
ChEMBL_338348 (CHEMBL865333)
EC50
10±n/a nM
Citation
 Garcia Collazo, AMKoehler, KFGarg, NFärnegårdh, MHusman, BYe, LLjunggren, JMellström, KSandberg, JGrynfarb, MAhola, HMalm, J Thyroid receptor ligands. Part 5: novel bicyclic agonist ligands selective for the thyroid hormone receptor beta. Bioorg Med Chem Lett 16:1240-4 (2006)  
Target
Name:
Thyroid hormone receptor alpha
Synonyms:
C-erbA-alpha EAR7 NR1A1 THA_HUMAN THRA1 Thyroid Hormone Receptor (TR-alpha) Thyroid hormone receptor alpha c-erbA-1
Type:
Receptor
Mol. Mass.:
54818.00
Organism:
Homo sapiens (Human)
Description:
Recombinant hThR was obtained from nuclear extracts from SF9 cells infected with baculovirus vectors encoding for ThRalpha 1.
Residue:
490
  
Inhibitor
Name:
BDBM50178975
Synonyms:
4,6-dichloro-5-(4-hydroxy-3-isopropylphenoxy)-1H-indole-2-carboxylic acid | CHEMBL203777
Type:
Small organic molecule
Emp. Form.:
C18H15Cl2NO4
Mol. Mass.:
380.222
SMILES:
CC(C)c1cc(Oc2c(Cl)cc3[nH]c(cc3c2Cl)C(O)=O)ccc1O
: