Target
Thyroid hormone receptor alpha
Ligand
BDBM50178972
Substrate
Meas. Tech.
ChEMBL_338348 (CHEMBL865333)
EC50
4.1±n/a nM
Citation
 Garcia Collazo, AMKoehler, KFGarg, NFärnegårdh, MHusman, BYe, LLjunggren, JMellström, KSandberg, JGrynfarb, MAhola, HMalm, J Thyroid receptor ligands. Part 5: novel bicyclic agonist ligands selective for the thyroid hormone receptor beta. Bioorg Med Chem Lett 16:1240-4 (2006)  
Target
Name:
Thyroid hormone receptor alpha
Synonyms:
C-erbA-alpha EAR7 NR1A1 THA_HUMAN THRA1 Thyroid Hormone Receptor (TR-alpha) Thyroid hormone receptor alpha c-erbA-1
Type:
Receptor
Mol. Mass.:
54818.00
Organism:
Homo sapiens (Human)
Description:
Recombinant hThR was obtained from nuclear extracts from SF9 cells infected with baculovirus vectors encoding for ThRalpha 1.
Residue:
490
  
Inhibitor
Name:
BDBM50178972
Synonyms:
4,6-dibromo-5-(4-hydroxy-3-isopropylphenoxy)-2,3-dihydro-1H-indene-2-carboxylic acid | CHEMBL203828
Type:
Small organic molecule
Emp. Form.:
C19H18Br2O4
Mol. Mass.:
470.152
SMILES:
CC(C)c1cc(Oc2c(Br)cc3CC(Cc3c2Br)C(O)=O)ccc1O
: