Target
P2Y purinoceptor 6
Ligand
BDBM50410570
Substrate
Meas. Tech.
ChEMBL_325347 (CHEMBL858654)
EC50
230±n/a nM
Citation
 Costanzi, SJoshi, BVMaddileti, SMamedova, LGonzalez-Moa, MJMarquez, VEHarden, TKJacobson, KA Human P2Y(6) receptor: molecular modeling leads to the rational design of a novel agonist based on a unique conformational preference. J Med Chem 48:8108-11 (2005)  
Target
Name:
P2Y purinoceptor 6
Synonyms:
P2RY6 P2Y purinoceptor 6 Pyrimidinergic receptor P2Y6
Type:
PROTEIN
Mol. Mass.:
36452.29
Organism:
Homo sapiens (Human)
Description:
ChEMBL_1511151
Residue:
328
  
Inhibitor
Name:
BDBM50410570
Synonyms:
CHEMBL2113161
Type:
Small organic molecule
Emp. Form.:
C11H16N2O10P2
Mol. Mass.:
398.1997
SMILES:
O[C@H]1C[C@]2(C[C@H]2[C@@H]1COP(O)(=O)OP(O)(O)=O)n1ccc(=O)[nH]c1=O
: