Target
Renin
Ligand
BDBM18012
Substrate
Meas. Tech.
ChEMBL_2236012 (CHEMBL5149784)
IC50
0.067000±n/a nM
Citation
 Iijima, DSugama, HAwai, NTakahashi, YTogashi, YTakebe, TXie, JShen, JKe, YAkatsuka, HKawaguchi, TTakedomi, KKashima, ANishio, MInui, YYoneda, HXia, GIijima, T Discovery of Novel 2-Carbamoyl Morpholine Derivatives as Highly Potent and Orally Active Direct Renin Inhibitors. ACS Med Chem Lett 13:1351-1357 (2022) Target
Name:
Renin
Synonyms:
Angiotensinogenase RENI_HUMAN
Type:
Enzyme
Mol. Mass.:
45058.99
Organism:
Homo sapiens (Human)
Description:
Residue:
406
  
Inhibitor
Name:
BDBM18012
Synonyms:
trans,trans-4-arylpiperidine-based compound, 1
Type:
Small organic molecule
Emp. Form.:
C38H47NO8
Mol. Mass.:
645.7817
SMILES:
COC[C@@H](O)CO[C@@H]1CNC[C@H](OCc2cc(OC)c3ccccc3c2)[C@H]1c1ccc(OCCCOCc2ccccc2OC)cc1
: