Target
Renin
Ligand
BDBM50601200
Substrate
Meas. Tech.
ChEMBL_2236015 (CHEMBL5149787)
IC50
1.4±n/a nM
Citation
 Iijima, DSugama, HAwai, NTakahashi, YTogashi, YTakebe, TXie, JShen, JKe, YAkatsuka, HKawaguchi, TTakedomi, KKashima, ANishio, MInui, YYoneda, HXia, GIijima, T Discovery of Novel 2-Carbamoyl Morpholine Derivatives as Highly Potent and Orally Active Direct Renin Inhibitors. ACS Med Chem Lett 13:1351-1357 (2022) Target
Name:
Renin
Synonyms:
Angiotensinogenase RENI_HUMAN
Type:
Enzyme
Mol. Mass.:
45058.99
Organism:
Homo sapiens (Human)
Description:
Residue:
406
  
Inhibitor
Name:
BDBM50601200
Synonyms:
CHEMBL5203297
Type:
Small organic molecule
Emp. Form.:
C22H30N4O4
Mol. Mass.:
414.498
SMILES:
COC(=O)NCCCn1cc(CN(C2CC2)C(=O)C2CNCCO2)c2ccccc12
: