Target
Aromatase
Ligand
BDBM50182536
Substrate
Meas. Tech.
ChEMBL_334394 (CHEMBL864308)
IC50
2510±n/a nM
Citation
 Su, BDiaz-Cruz, ESLandini, SBrueggemeier, RW Novel sulfonanilide analogues suppress aromatase expression and activity in breast cancer cells independent of COX-2 inhibition. J Med Chem 49:1413-9 (2006)  
Target
Name:
Aromatase
Synonyms:
ARO1 CP19A_HUMAN CYP19 CYPXIX Cytochrome P450 19A1 Cytochrome P450-C19 (CYP19) FL cytokine receptor precursor | P-450AROM
Type:
Enzyme
Mol. Mass.:
57888.92
Organism:
Homo sapiens (Human)
Description:
P11511
Residue:
503
  
Inhibitor
Name:
BDBM50182536
Synonyms:
CHEMBL204184 N-(4-nitro-2-propoxyphenyl)methanesulfonamide
Type:
Small organic molecule
Emp. Form.:
C10H14N2O5S
Mol. Mass.:
274.294
SMILES:
CCCOc1cc(ccc1NS(C)(=O)=O)[N+]([O-])=O
: