Target
Cytochrome P450 3A4
Ligand
BDBM50183230
Substrate
Meas. Tech.
ChEMBL_355280 (CHEMBL853201)
IC50
8000±n/a nM
Citation
 Mulvihill, MJKan, JLCooke, ABhagwat, SBeck, PBittner, MCesario, CKeane, DLazarescu, VNigro, ANillson, CPanicker, BSmith, VSrebernak, MSun, FLO'Connor, MRusso, SFischetti, GVrkljan, MWinski, SCastelhano, ALEmerson, DGibson, NW 3-[6-(2-Dimethylamino-1-imidazol-1-yl-butyl)-naphthalen-2-yloxy]-2,2-dimethyl-propionic acid as a highly potent and selective retinoic acid metabolic blocking agent. Bioorg Med Chem Lett 16:2729-33 (2006)  
Target
Name:
Cytochrome P450 3A4
Synonyms:
Albendazole monooxygenase CP3A4_HUMAN CYP3A4 CYPIIIA4 Cytochrome P450 3A4 (CYP3A4) Nifedipine oxidase Taurochenodeoxycholate 6-alpha-hydroxylase
Type:
Enzyme
Mol. Mass.:
57349.57
Organism:
Homo sapiens (Human)
Description:
Residue:
503
  
Inhibitor
Name:
BDBM50183230
Synonyms:
1-((6-((1R,2R)-2-(dimethylamino)-1-(1H-imidazol-1-yl)propyl)naphthalen-2-yloxy)methyl)cyclohexanecarboxylic acid | CHEMBL207638
Type:
Small organic molecule
Emp. Form.:
C26H33N3O3
Mol. Mass.:
435.5585
SMILES:
C[C@H]([C@@H](c1ccc2cc(OCC3(CCCCC3)C(O)=O)ccc2c1)n1ccnc1)N(C)C
: