Target
Procathepsin L
Ligand
BDBM50602542
Substrate
Meas. Tech.
ChEMBL_2241124 (CHEMBL5155334)
Ki
18.0±n/a nM
Citation
 Ashhurst, ASTang, AHFajtová, PYoon, MCAggarwal, ABedding, MJStoye, ABeretta, LPwee, DDrelich, ASkinner, DLi, LMeek, TDMcKerrow, JHHook, VTseng, CTLarance, MTurville, SGerwick, WHO'Donoghue, AJPayne, RJ Potent Anti-SARS-CoV-2 Activity by the Natural Product Gallinamide A and Analogues via Inhibition of Cathepsin L. J Med Chem 65:2956-2970 (2022) Target
Name:
Procathepsin L
Synonyms:
CATL1_HUMAN CTSL CTSL1 Cathepsin L Cathepsin L1 heavy chain MEP cathepsin L preproprotein
Type:
Enzyme
Mol. Mass.:
37557.19
Organism:
Homo sapiens (Human)
Description:
Purchased from Calbiochem (San Diego, CA).
Residue:
333
  
Inhibitor
Name:
BDBM50602542
Synonyms:
CHEMBL4594870
Type:
Small organic molecule
Emp. Form.:
C41H58N6O6
Mol. Mass.:
730.9358
SMILES:
COC1=CC(=O)N([C@H]1Cc1c[nH]c2ccccc12)C(=O)\C=C\[C@H](C)NC(=O)[C@H](CC(C)C)NC(=O)[C@H](CC1CCCCC1)NC(=O)C1CCN(C)CC1
: