Target
Oxysterols receptor LXR-beta
Ligand
BDBM50184263
Substrate
Meas. Tech.
ChEMBL_364820 (CHEMBL870849)
IC50
65±n/a nM
Citation
 Szewczyk, JWHuang, SChin, JTian, JMitnaul, LRosa, RLPeterson, LSparrow, CPAdams, AD SAR studies: designing potent and selective LXR agonists. Bioorg Med Chem Lett 16:3055-60 (2006)  
Target
Name:
Oxysterols receptor LXR-beta
Synonyms:
LXRB Liver X, LXR beta NR1H2 Nuclear receptor NER Ubiquitously-expressed nuclear receptor
Type:
Enzyme Catalytic Domain
Mol. Mass.:
50978.79
Organism:
Homo sapiens (Human)
Description:
P55055
Residue:
460
  
Inhibitor
Name:
BDBM50184263
Synonyms:
2-(3-chloro-4-(3-(7-propyl-3-(trifluoromethyl)benzo[d]isoxazol-6-yloxy)propoxy)phenyl)acetic acid | CHEMBL210768
Type:
Small organic molecule
Emp. Form.:
C22H21ClF3NO5
Mol. Mass.:
471.854
SMILES:
CCCc1c(OCCCOc2ccc(CC(O)=O)cc2Cl)ccc2c(noc12)C(F)(F)F
: