Target
Oxysterols receptor LXR-beta
Ligand
BDBM50184255
Substrate
Meas. Tech.
ChEMBL_364820 (CHEMBL870849)
IC50
16±n/a nM
Citation
 Szewczyk, JWHuang, SChin, JTian, JMitnaul, LRosa, RLPeterson, LSparrow, CPAdams, AD SAR studies: designing potent and selective LXR agonists. Bioorg Med Chem Lett 16:3055-60 (2006)  
Target
Name:
Oxysterols receptor LXR-beta
Synonyms:
LXRB Liver X, LXR beta NR1H2 Nuclear receptor NER Ubiquitously-expressed nuclear receptor
Type:
Enzyme Catalytic Domain
Mol. Mass.:
50978.79
Organism:
Homo sapiens (Human)
Description:
P55055
Residue:
460
  
Inhibitor
Name:
BDBM50184255
Synonyms:
2-(1-(3-(7-propyl-3-(trifluoromethyl)benzo[d]isoxazol-6-yloxy)propyl)-1H-indol-5-yl)acetic acid | CHEMBL383728
Type:
Small organic molecule
Emp. Form.:
C24H23F3N2O4
Mol. Mass.:
460.4456
SMILES:
CCCc1c(OCCCn2ccc3cc(CC(O)=O)ccc23)ccc2c(noc12)C(F)(F)F
: