Target
Oxysterols receptor LXR-beta
Ligand
BDBM50184250
Substrate
Meas. Tech.
ChEMBL_364820 (CHEMBL870849)
IC50
18±n/a nM
Citation
 Szewczyk, JWHuang, SChin, JTian, JMitnaul, LRosa, RLPeterson, LSparrow, CPAdams, AD SAR studies: designing potent and selective LXR agonists. Bioorg Med Chem Lett 16:3055-60 (2006)  
Target
Name:
Oxysterols receptor LXR-beta
Synonyms:
LXRB Liver X, LXR beta NR1H2 Nuclear receptor NER Ubiquitously-expressed nuclear receptor
Type:
Enzyme Catalytic Domain
Mol. Mass.:
50978.79
Organism:
Homo sapiens (Human)
Description:
P55055
Residue:
460
  
Inhibitor
Name:
BDBM50184250
Synonyms:
2-(4-(methyl(3-(7-propyl-3-(trifluoromethyl)benzo[d]isoxazol-6-yloxy)propyl)amino)-2-(trifluoromethyl)phenyl)acetic acid | CHEMBL382789
Type:
Small organic molecule
Emp. Form.:
C24H24F6N2O4
Mol. Mass.:
518.4488
SMILES:
CCCc1c(OCCCN(C)c2ccc(CC(O)=O)c(c2)C(F)(F)F)ccc2c(noc12)C(F)(F)F
: