Target
Oxysterols receptor LXR-alpha
Ligand
BDBM50184256
Substrate
Meas. Tech.
ChEMBL_364822 (CHEMBL870169)
IC50
117±n/a nM
Citation
 Szewczyk, JWHuang, SChin, JTian, JMitnaul, LRosa, RLPeterson, LSparrow, CPAdams, AD SAR studies: designing potent and selective LXR agonists. Bioorg Med Chem Lett 16:3055-60 (2006)  
Target
Name:
Oxysterols receptor LXR-alpha
Synonyms:
LXRA Liver X receptor alpha Liver X receptor alpha (NR1H3) NR1H3 Nuclear orphan receptor LXR-alpha | Nuclear receptor subfamily 1 group H member 3
Type:
Enzyme Catalytic Domain
Mol. Mass.:
50403.85
Organism:
Homo sapiens (Human)
Description:
Q13133
Residue:
447
  
Inhibitor
Name:
BDBM50184256
Synonyms:
2-(2-methyl-4-(methyl(3-(7-propyl-3-(trifluoromethyl)benzo[d]isoxazol-6-yloxy)propyl)amino)phenyl)acetic acid | CHEMBL427040
Type:
Small organic molecule
Emp. Form.:
C24H27F3N2O4
Mol. Mass.:
464.4774
SMILES:
CCCc1c(OCCCN(C)c2ccc(CC(O)=O)c(C)c2)ccc2c(noc12)C(F)(F)F
: