Target
Oxysterols receptor LXR-alpha
Ligand
BDBM50184249
Substrate
Meas. Tech.
ChEMBL_364822 (CHEMBL870169)
IC50
18±n/a nM
Citation
 Szewczyk, JWHuang, SChin, JTian, JMitnaul, LRosa, RLPeterson, LSparrow, CPAdams, AD SAR studies: designing potent and selective LXR agonists. Bioorg Med Chem Lett 16:3055-60 (2006)  
Target
Name:
Oxysterols receptor LXR-alpha
Synonyms:
LXRA Liver X receptor alpha Liver X receptor alpha (NR1H3) NR1H3 Nuclear orphan receptor LXR-alpha | Nuclear receptor subfamily 1 group H member 3
Type:
Enzyme Catalytic Domain
Mol. Mass.:
50403.85
Organism:
Homo sapiens (Human)
Description:
Q13133
Residue:
447
  
Inhibitor
Name:
BDBM50184249
Synonyms:
3-(1-(3-(7-propyl-3-(trifluoromethyl)benzo[d]isoxazol-6-yloxy)propyl)-1H-indol-5-yl)propanoic acid | CHEMBL207907
Type:
Small organic molecule
Emp. Form.:
C25H25F3N2O4
Mol. Mass.:
474.4722
SMILES:
CCCc1c(OCCCn2ccc3cc(CCC(O)=O)ccc23)ccc2c(noc12)C(F)(F)F
: