Target
Oxysterols receptor LXR-alpha
Ligand
BDBM50184253
Substrate
Meas. Tech.
ChEMBL_364822 (CHEMBL870169)
IC50
102±n/a nM
Citation
 Szewczyk, JWHuang, SChin, JTian, JMitnaul, LRosa, RLPeterson, LSparrow, CPAdams, AD SAR studies: designing potent and selective LXR agonists. Bioorg Med Chem Lett 16:3055-60 (2006)  
Target
Name:
Oxysterols receptor LXR-alpha
Synonyms:
LXRA Liver X receptor alpha Liver X receptor alpha (NR1H3) NR1H3 Nuclear orphan receptor LXR-alpha | Nuclear receptor subfamily 1 group H member 3
Type:
Enzyme Catalytic Domain
Mol. Mass.:
50403.85
Organism:
Homo sapiens (Human)
Description:
Q13133
Residue:
447
  
Inhibitor
Name:
BDBM50184253
Synonyms:
2-(3-(methyl(3-(7-propyl-3-(trifluoromethyl)benzo[d]isoxazol-6-yloxy)propyl)amino)phenyl)acetic acid | CHEMBL207442
Type:
Small organic molecule
Emp. Form.:
C23H25F3N2O4
Mol. Mass.:
450.4508
SMILES:
CCCc1c(OCCCN(C)c2cccc(CC(O)=O)c2)ccc2c(noc12)C(F)(F)F
: