Target
Peroxisome proliferator-activated receptor delta
Ligand
BDBM50184274
Substrate
Meas. Tech.
ChEMBL_364829 (CHEMBL870176)
IC50
88±n/a nM
Citation
 Szewczyk, JWHuang, SChin, JTian, JMitnaul, LRosa, RLPeterson, LSparrow, CPAdams, AD SAR studies: designing potent and selective LXR agonists. Bioorg Med Chem Lett 16:3055-60 (2006)  
Target
Name:
Peroxisome proliferator-activated receptor delta
Synonyms:
NR1C2 NUCI Nuclear receptor subfamily 1 group C member 2 PPAR-beta PPARD Peroxisome proliferator-activated receptor Peroxisome proliferator-activated receptor delta
Type:
Enzyme
Mol. Mass.:
49910.45
Organism:
Homo sapiens (Human)
Description:
Q03181
Residue:
441
  
Inhibitor
Name:
BDBM50184274
Synonyms:
2-(4-(3-(7-propyl-3-(trifluoromethyl)benzo[d]isoxazol-6-yloxy)propylamino)phenyl)acetic acid | CHEMBL207103
Type:
Small organic molecule
Emp. Form.:
C22H23F3N2O4
Mol. Mass.:
436.4242
SMILES:
CCCc1c(OCCCNc2ccc(CC(O)=O)cc2)ccc2c(noc12)C(F)(F)F
: