Target
Xanthine dehydrogenase/oxidase
Ligand
BDBM50140241
Substrate
Meas. Tech.
ChEMBL_2242993 (CHEMBL5157203)
Ki
700±n/a nM
Citation
 Zhao, JMao, QLin, FZhang, BSun, MZhang, TWang, S Intramolecular hydrogen bond interruption and scaffold hopping of TMC-5 led to 2-(4-alkoxy-3-cyanophenyl)pyrimidine-4/5-carboxylic acids and 6-(4-alkoxy-3-cyanophenyl)-1,2-dihydro-3H-pyrazolo[3,4-d]pyrimidin-3-ones as potent pyrimidine-based xanthine oxidase inhibitors. Eur J Med Chem 229:0 (2022) Target
Name:
Xanthine dehydrogenase/oxidase
Synonyms:
XD XDHA XO Xanthine dehydrogenase/oxidase | Xanthine oxidase
Type:
Enzyme
Mol. Mass.:
146441.21
Organism:
Homo sapiens (Human)
Description:
P47989
Residue:
1333
  
Inhibitor
Name:
BDBM50140241
Synonyms:
Allopurinol Aluline 100 BW-56-158 CHEBI:40279 Cosuric Hamarin 300 Lopurin Uricto Xanthomax-300 Zyloric | Zyloric-300
Type:
Small organic molecule
Emp. Form.:
C5H4N4O
Mol. Mass.:
136.1115
SMILES:
O=c1[nH]cnc2[nH]ncc12
: