Target
C-X-C chemokine receptor type 2
Ligand
BDBM50184541
Substrate
Meas. Tech.
ChEMBL_355078 (CHEMBL870125)
Ki
90±n/a nM
Citation
 Ho, KKAuld, DSBohnstedt, ACConti, PDokter, WErickson, SFeng, DInglese, JKingsbury, CKultgen, SGLiu, RQMasterson, CMOhlmeyer, MRong, YRooseboom, MRoughton, ASamama, PSmit, MJSon, Evan der Louw, JVogel, GWebb, MWijkmans, JYou, M Imidazolylpyrimidine based CXCR2 chemokine receptor antagonists. Bioorg Med Chem Lett 16:2724-8 (2006)  
Target
Name:
C-X-C chemokine receptor type 2
Synonyms:
C-X-C chemokine receptor type 2 (CXCR-2) CD_antigen=CD182 CXCR-2 CXCR2_HUMAN GRO/MGSA receptor IL-8 receptor type 2 IL8RB | Interleukin-8 receptor B
Type:
Protein
Mol. Mass.:
40767.88
Organism:
Homo sapiens (Human)
Description:
P25025
Residue:
360
  
Inhibitor
Name:
BDBM50184541
Synonyms:
(2S)-2-(6-butyl-2-(4-methyl-1H-imidazol-1-yl)pyrimidin-4-ylamino)-N-(3-ethoxypropyl)-4-methylpentanamide | CHEMBL207276
Type:
Small organic molecule
Emp. Form.:
C23H38N6O2
Mol. Mass.:
430.5868
SMILES:
CCCCc1cc(N[C@@H](CC(C)C)C(=O)NCCCOCC)nc(n1)-n1cnc(C)c1
: