Target
Cysteine protease ATG4B
Ligand
BDBM50604041
Substrate
Meas. Tech.
ChEMBL_2246463 (CHEMBL5160673)
Ki
3100±n/a nM
Citation
 Kudo, YEndo, SFujita, MOta, AKamatari, YOTanaka, YIshikawa, TIkeda, HOkada, TToyooka, NFujimoto, NMatsunaga, TIkari, A Discovery and Structure-Based Optimization of Novel Atg4B Inhibitors for the Treatment of Castration-Resistant Prostate Cancer. J Med Chem 65:4878-4892 (2022) Target
Name:
Cysteine protease ATG4B
Synonyms:
APG4B ATG4B_HUMAN KIAA0943 hck
Type:
Enzyme Catalytic Domain
Mol. Mass.:
44279.79
Organism:
Homo sapiens (Human)
Description:
gi_47132611
Residue:
393
  
Inhibitor
Name:
BDBM50604041
Synonyms:
CHEMBL5200146
Type:
Small organic molecule
Emp. Form.:
C21H30O3
Mol. Mass.:
330.4611
SMILES:
CCCCCCCCCCCc1ccc(cc1)C(=O)\C=C\C(O)=O
: