Target
Gamma-aminobutyric acid receptor subunit alpha-3/beta-3/gamma-2
Ligand
BDBM50185333
Substrate
Meas. Tech.
ChEMBL_341840 (CHEMBL865019)
Ki
5±n/a nM
Citation
 Lewis, RTBlackaby, WPBlackburn, TJennings, ASPike, AWilson, RAHallett, DJCook, SMFerris, PMarshall, GRReynolds, DSSheppard, WFSmith, AJSohal, BStanley, JTye, SJWafford, KAAtack, JR A pyridazine series of alpha2/alpha3 subtype selective GABA A agonists for the treatment of anxiety. J Med Chem 49:2600-10 (2006)  
Target
Name:
Gamma-aminobutyric acid receptor subunit alpha-3/beta-3/gamma-2
Synonyms:
GABA receptor alpha-3/beta-3/gamma-2 subunit | GABA-A receptor; alpha-3/beta-3/gamma-2
Type:
Mol. Mass.:
Description:
ASSAY_ID of EBI is 68410
Components:
This complex has 3 components.
Component 1
Name:
Gamma-aminobutyric acid receptor subunit gamma-2
Synonyms:
GABA(A) receptor subunit gamma-2 GBRG2_HUMAN
Type:
PROTEIN
Mol. Mass.:
54172.74
Organism:
Homo sapiens (Human)
Description:
EBI_217
Residue:
467
  
Component 2
Name:
Gamma-aminobutyric acid receptor subunit beta-3
Synonyms:
GABA A receptor alpha-4/beta-3/gamma-2 GABA-A receptor GBRB3_HUMAN | agonist GABA site
Type:
PROTEIN
Mol. Mass.:
54130.51
Organism:
Homo sapiens (Human)
Description:
ChEMBL_448071
Residue:
473
  
Component 3
Name:
Gamma-aminobutyric acid receptor subunit alpha-3
Synonyms:
GABA A Alpha3Beta3Gamma2 GABA C GABA-A receptor GBRA3_HUMAN agonist GABA site
Type:
Enzyme Catalytic Domain
Mol. Mass.:
55175.47
Organism:
Homo sapiens (Human)
Description:
GABA A Alpha3Beta1Gamma2 0 HUMAN::P34903
Residue:
492
  
Inhibitor
Name:
BDBM50185333
Synonyms:
5-[3-(3,5-difluoropyridin-2-yl)-4-fluorophenyl]-3-(2,4,6-trifluorophenyl)pyridazine | CHEMBL203896
Type:
Small organic molecule
Emp. Form.:
C21H9F6N3
Mol. Mass.:
417.3067
SMILES:
Fc1cnc(c(F)c1)-c1cc(ccc1F)-c1cnnc(c1)-c1c(F)cc(F)cc1F
: