Target
GABA-A receptor; alpha-2/beta-3/gamma-2
Ligand
BDBM50185331
Substrate
Meas. Tech.
ChEMBL_341856 (CHEMBL870713)
Ki
10.91±n/a nM
Citation
 Lewis, RTBlackaby, WPBlackburn, TJennings, ASPike, AWilson, RAHallett, DJCook, SMFerris, PMarshall, GRReynolds, DSSheppard, WFSmith, AJSohal, BStanley, JTye, SJWafford, KAAtack, JR A pyridazine series of alpha2/alpha3 subtype selective GABA A agonists for the treatment of anxiety. J Med Chem 49:2600-10 (2006)  
Target
Name:
GABA-A receptor; alpha-2/beta-3/gamma-2
Synonyms:
GABA receptor alpha-2/beta-3/gamma-2 subunit | Gamma-aminobutyric acid receptor subunit alpha-2/beta-3/gamma-2
Type:
Mol. Mass.:
Description:
ASSAY_ID of ChEMBL is 2148174
Components:
This complex has 3 components.
Component 1
Name:
Gamma-aminobutyric acid receptor subunit gamma-2
Synonyms:
GABA(A) receptor subunit gamma-2 GBRG2_HUMAN
Type:
PROTEIN
Mol. Mass.:
54172.74
Organism:
Homo sapiens (Human)
Description:
EBI_217
Residue:
467
  
Component 2
Name:
Gamma-aminobutyric acid receptor subunit beta-3
Synonyms:
GABA A receptor alpha-4/beta-3/gamma-2 GABA-A receptor GBRB3_HUMAN | agonist GABA site
Type:
PROTEIN
Mol. Mass.:
54130.51
Organism:
Homo sapiens (Human)
Description:
ChEMBL_448071
Residue:
473
  
Component 3
Name:
Gamma-aminobutyric acid receptor subunit alpha-2
Synonyms:
GABA receptor alpha-2 subunit GBRA2_HUMAN | Gamma-aminobutyric acid receptor subunit alpha-2 (GABRA2)
Type:
Protein
Mol. Mass.:
51338.78
Organism:
Homo sapiens (Human)
Description:
P47869
Residue:
451
  
Inhibitor
Name:
BDBM50185331
Synonyms:
5-[4-fluoro-3-(3,5-difluoropyridin-2-yl)-phenyl]-3-(3,5-difluoropyridin-2-yl)pyridazine | CHEMBL202789
Type:
Small organic molecule
Emp. Form.:
C20H9F5N4
Mol. Mass.:
400.3043
SMILES:
Fc1cnc(c(F)c1)-c1cc(cnn1)-c1ccc(F)c(c1)-c1ncc(F)cc1F
: