Target
Serine/threonine-protein kinase tousled-like 1
Ligand
BDBM311210
Substrate
Meas. Tech.
ChEMBL_2247044 (CHEMBL5161254)
IC50
1200±n/a nM
Citation
 Luo, GChen, LKostich, WAHamman, BAllen, JEaston, ABourin, CGulianello, MLippy, JNara, SPattipati, SNDandapani, KDokania, MVattikundala, PSharma, VElavazhagan, SVerma, MKLal Das, MWagh, SBalakrishnan, AJohnson, BMSantone, KSThalody, GDenton, RSaminathan, HHolenarsipur, VKKumar, ARao, APutlur, SPSarvasiddhi, SKShankar, GLouis, JVRamarao, MConway, CMLi, YWPieschl, RTian, YHong, YBristow, LAlbright, CFBronson, JJMacor, JEDzierba, CD Discovery and Optimization of Biaryl Alkyl Ethers as a Novel Class of Highly Selective, CNS-Penetrable, and Orally Active Adaptor Protein-2-Associated Kinase 1 (AAK1) Inhibitors for the Potential Treatment of Neuropathic Pain. J Med Chem 65:4534-4564 (2022) Target
Name:
Serine/threonine-protein kinase tousled-like 1
Synonyms:
KIAA0137 TLK1 | TLK1_HUMAN
Type:
Enzyme Catalytic Domain
Mol. Mass.:
86722.30
Organism:
Homo sapiens (Human)
Description:
gi_33636698
Residue:
766
  
Inhibitor
Name:
BDBM311210
Synonyms:
(S)-methyl (5-((2-amino-2,4-dimethylpentyl)oxy)-6-chloro-[2,4′-bipyridin]-2′-yl)carbamate US10351563, Example 66 US10723734, Example 66 US9902722, Example 66
Type:
Small organic molecule
Emp. Form.:
C19H25ClN4O3
Mol. Mass.:
392.88
SMILES:
COC(=O)Nc1cc(ccn1)-c1ccc(OC[C@@](C)(N)CC(C)C)c(Cl)n1
: