Target
Fibroblast growth factor receptor 4
Ligand
BDBM50604182
Substrate
Meas. Tech.
ChEMBL_2247111 (CHEMBL5161321)
IC50
0.500000±n/a nM
Citation
 Shao, MChen, XYang, FSong, XZhou, YLin, QFu, YOrtega, RLin, XTu, ZPatterson, AVSmaill, JBChen, YLu, X Design, Synthesis, and Biological Evaluation of Aminoindazole Derivatives as Highly Selective Covalent Inhibitors of Wild-Type and Gatekeeper Mutant FGFR4. J Med Chem 65:5113-5133 (2022) Target
Name:
Fibroblast growth factor receptor 4
Synonyms:
CD_antigen: CD334 FGFR4 FGFR4 Fibroblast growth factor receptor JK2 TKF
Type:
Protein
Mol. Mass.:
87957.45
Organism:
Homo sapiens (Human)
Description:
P22455
Residue:
802
  
Inhibitor
Name:
BDBM50604182
Synonyms:
CHEMBL5194425
Type:
Small organic molecule
Emp. Form.:
C32H34Cl2FN7O3
Mol. Mass.:
654.562
SMILES:
C[C@@H](Oc1ccc2[nH]nc(Nc3c(F)cc(cc3NC(=O)C=C)N3CCC(CC3)N3CCOCC3)c2c1)c1c(Cl)cncc1Cl
: