Target
5-hydroxytryptamine receptor 2A
Ligand
BDBM50185783
Substrate
Meas. Tech.
ChEMBL_361713 (CHEMBL861444)
Ki
8.1±n/a nM
Citation
 Ladduwahetty, TBoase, ALMitchinson, AQuin, CPatel, SChapman, KMacLeod, AM A new class of selective, non-basic 5-HT2A receptor antagonists. Bioorg Med Chem Lett 16:3201-4 (2006)  
Target
Name:
5-hydroxytryptamine receptor 2A
Synonyms:
5-HT-2 5-HT2A 5-hydroxytryptamine receptor 2A (5HT-2A) 5HT2A_HUMAN HTR2A | Serotonin receptor 2A
Type:
undefined
Mol. Mass.:
52607.65
Organism:
Homo sapiens (Human)
Description:
P28223
Residue:
471
  
Inhibitor
Name:
BDBM50185783
Synonyms:
2-(4-(2,4-difluorophenethyl)piperidin-1-ylsulfonyl)benzonitrile | CHEMBL206307
Type:
Small organic molecule
Emp. Form.:
C20H20F2N2O2S
Mol. Mass.:
390.447
SMILES:
Fc1ccc(CCC2CCN(CC2)S(=O)(=O)c2ccccc2C#N)c(F)c1
: