Target
Delta-type opioid receptor
Ligand
BDBM50185804
Substrate
Meas. Tech.
ChEMBL_372755 (CHEMBL871099)
Ki
>5000±n/a nM
Citation
 Bignan, GCBattista, KConnolly, PJOrsini, MJLiu, JMiddleton, SAReitz, AB 3-(4-Piperidinyl)indoles and 3-(4-piperidinyl)pyrrolo-[2,3-b]pyridines as ligands for the ORL-1 receptor. Bioorg Med Chem Lett 16:3524-8 (2006)  
Target
Name:
Delta-type opioid receptor
Synonyms:
D-OR-1 Delta opioid receptor OPIATE Delta OPRD1 OPRK1 | opioid receptor, delta 1
Type:
G Protein-Coupled Receptor (GPCR)
Mol. Mass.:
40382.98
Organism:
Homo sapiens (Human)
Description:
Competition binding assays were carried out using membrane preparations from transfected HN9.10 cells that constitutively expressed the delta opioid receptor.
Residue:
372
  
Inhibitor
Name:
BDBM50185804
Synonyms:
1-benzyl-6-chloro-3-(1-(1,2-dihydroacenaphthylen-1-yl)piperidin-4-yl)-1H-indole | CHEMBL376964
Type:
Small organic molecule
Emp. Form.:
C32H29ClN2
Mol. Mass.:
477.039
SMILES:
Clc1ccc2c(cn(Cc3ccccc3)c2c1)C1CCN(CC1)C1Cc2cccc3cccc1c23
: