Target
Nociceptin receptor
Ligand
BDBM50185804
Substrate
Meas. Tech.
ChEMBL_372756 (CHEMBL871100)
Ki
>5000±n/a nM
Citation
 Bignan, GCBattista, KConnolly, PJOrsini, MJLiu, JMiddleton, SAReitz, AB 3-(4-Piperidinyl)indoles and 3-(4-piperidinyl)pyrrolo-[2,3-b]pyridines as ligands for the ORL-1 receptor. Bioorg Med Chem Lett 16:3524-8 (2006)  
Target
Name:
Nociceptin receptor
Synonyms:
KOR-3 Mu-type opioid receptor (Mu) Nociceptin Receptor (ORL1 Receptor) Nociceptin receptor (ORL-1) Nociceptin/Orphanin FQ, NOP receptor OPIATE ORL-1 OPRL1 protein ORL1 Opioid receptor like-1 Orphanin FQ receptor (ORL1) | P41146
Type:
G Protein-Coupled Receptor (GPCR)
Mol. Mass.:
40702.87
Organism:
Homo sapiens (Human)
Description:
P41146
Residue:
370
  
Inhibitor
Name:
BDBM50185804
Synonyms:
1-benzyl-6-chloro-3-(1-(1,2-dihydroacenaphthylen-1-yl)piperidin-4-yl)-1H-indole | CHEMBL376964
Type:
Small organic molecule
Emp. Form.:
C32H29ClN2
Mol. Mass.:
477.039
SMILES:
Clc1ccc2c(cn(Cc3ccccc3)c2c1)C1CCN(CC1)C1Cc2cccc3cccc1c23
: