Target
Mu-type opioid receptor
Ligand
BDBM50185810
Substrate
Meas. Tech.
ChEMBL_372753 (CHEMBL871097)
Ki
1080±n/a nM
Citation
 Bignan, GCBattista, KConnolly, PJOrsini, MJLiu, JMiddleton, SAReitz, AB 3-(4-Piperidinyl)indoles and 3-(4-piperidinyl)pyrrolo-[2,3-b]pyridines as ligands for the ORL-1 receptor. Bioorg Med Chem Lett 16:3524-8 (2006)  
Target
Name:
Mu-type opioid receptor
Synonyms:
M-OR-1 MOR-1 MUOR1 Mu opiate receptor OPRM1 hMOP | mu-type opioid receptor isoform MOR-1
Type:
G Protein-Coupled Receptor (GPCR)
Mol. Mass.:
44789.51
Organism:
Homo sapiens (Human)
Description:
P35372
Residue:
400
  
Inhibitor
Name:
BDBM50185810
Synonyms:
3-(1-(cyclooctylmethyl)piperidin-4-yl)-5-fluoro-1H-indole | CHEMBL211846
Type:
Small organic molecule
Emp. Form.:
C22H31FN2
Mol. Mass.:
342.4933
SMILES:
Fc1ccc2[nH]cc(C3CCN(CC4CCCCCCC4)CC3)c2c1
: