Target
Nociceptin receptor
Ligand
BDBM50185810
Substrate
Meas. Tech.
ChEMBL_372756 (CHEMBL871100)
Ki
290±n/a nM
Citation
 Bignan, GCBattista, KConnolly, PJOrsini, MJLiu, JMiddleton, SAReitz, AB 3-(4-Piperidinyl)indoles and 3-(4-piperidinyl)pyrrolo-[2,3-b]pyridines as ligands for the ORL-1 receptor. Bioorg Med Chem Lett 16:3524-8 (2006)  
Target
Name:
Nociceptin receptor
Synonyms:
KOR-3 Mu-type opioid receptor (Mu) Nociceptin Receptor (ORL1 Receptor) Nociceptin receptor (ORL-1) Nociceptin/Orphanin FQ, NOP receptor OPIATE ORL-1 OPRL1 protein ORL1 Opioid receptor like-1 Orphanin FQ receptor (ORL1) | P41146
Type:
G Protein-Coupled Receptor (GPCR)
Mol. Mass.:
40702.87
Organism:
Homo sapiens (Human)
Description:
P41146
Residue:
370
  
Inhibitor
Name:
BDBM50185810
Synonyms:
3-(1-(cyclooctylmethyl)piperidin-4-yl)-5-fluoro-1H-indole | CHEMBL211846
Type:
Small organic molecule
Emp. Form.:
C22H31FN2
Mol. Mass.:
342.4933
SMILES:
Fc1ccc2[nH]cc(C3CCN(CC4CCCCCCC4)CC3)c2c1
: