Target
Group IIE secretory phospholipase A2
Ligand
BDBM50055366
Substrate
Meas. Tech.
ChEMBL_352636 (CHEMBL862127)
IC50
50±n/a nM
Citation
 Smart, BPOslund, RCWalsh, LAGelb, MH The first potent inhibitor of mammalian group X secreted phospholipase A2: elucidation of sites for enhanced binding. J Med Chem 49:2858-60 (2006)  
Target
Name:
Group IIE secretory phospholipase A2
Synonyms:
GIIE sPLA2 PLA2G2E sPLA(2)-IIE
Type:
PROTEIN
Mol. Mass.:
15997.10
Organism:
Homo sapiens (Human)
Description:
ChEMBL_489274
Residue:
142
  
Inhibitor
Name:
BDBM50055366
Synonyms:
(3-Aminooxalyl-1-benzyl-2-ethyl-1H-indol-4-yloxy)-acetic acid 2-(3-(2-amino-2-oxoacetyl)-1-benzyl-2-ethyl-1H-indol-4-yloxy)acetic acid Varespladib sodium
Type:
Small organic molecule
Emp. Form.:
C21H20N2O5
Mol. Mass.:
380.3939
SMILES:
CCc1c(C(=O)C(N)=O)c2c(OCC(O)=O)cccc2n1Cc1ccccc1
: