Target
Adenosine receptor A3
Ligand
BDBM50186591
Substrate
Meas. Tech.
ChEMBL_353094 (CHEMBL866938)
Ki
4±n/a nM
Citation
 Chang, LCSpanjersberg, RFvon Frijtag Drabbe Künzel, JKMulder-Krieger, TBrussee, JIjzerman, AP 2,6-disubstituted and 2,6,8-trisubstituted purines as adenosine receptor antagonists. J Med Chem 49:2861-7 (2006)  
Target
Name:
Adenosine receptor A3
Synonyms:
A3 adenosine receptor (hA3) ADORA3 | Adenosine A3 receptor (A3AR)
Type:
G Protein-Coupled Receptor (GPCR)
Mol. Mass.:
36197.32
Organism:
Homo sapiens (Human)
Description:
P0DMS8
Residue:
318
  
Inhibitor
Name:
BDBM50186591
Synonyms:
2-(4-methoxyphenyl)-6-phenyl-9H-purine | CHEMBL207760
Type:
Small organic molecule
Emp. Form.:
C18H14N4O
Mol. Mass.:
302.33
SMILES:
COc1ccc(cc1)-c1nc(-c2ccccc2)c2[nH]cnc2n1
: