Target
Adenosine receptor A1
Ligand
BDBM50186590
Substrate
Meas. Tech.
ChEMBL_353090 (CHEMBL866934)
Ki
0.82±n/a nM
Citation
 Chang, LCSpanjersberg, RFvon Frijtag Drabbe Künzel, JKMulder-Krieger, TBrussee, JIjzerman, AP 2,6-disubstituted and 2,6,8-trisubstituted purines as adenosine receptor antagonists. J Med Chem 49:2861-7 (2006)  
Target
Name:
Adenosine receptor A1
Synonyms:
A1 adenosine receptor (hA1) AA1R_HUMAN ADORA1 Adenosine A1-receptor Adenosine receptor A1 (hA1) | Adenosine transporter (AdT)
Type:
G Protein-Coupled Receptor (GPCR)
Mol. Mass.:
36520.92
Organism:
Homo sapiens (Human)
Description:
P30542
Residue:
326
  
Inhibitor
Name:
BDBM50186590
Synonyms:
8-isopropyl-2,6-diphenyl-9H-purine LUF-5956
Type:
Small organic molecule
Emp. Form.:
C20H18N4
Mol. Mass.:
314.3837
SMILES:
CC(C)c1nc2nc(nc(-c3ccccc3)c2[nH]1)-c1ccccc1
: