Target
Metabotropic glutamate receptor 5
Ligand
BDBM50187625
Substrate
Meas. Tech.
ChEMBL_361059 (CHEMBL859181)
Ki
110±n/a nM
Citation
 de Paulis, THemstapat, KChen, YZhang, YSaleh, SAlagille, DBaldwin, RMTamagnan, GDConn, PJ Substituent effects of N-(1,3-diphenyl-1H-pyrazol-5-yl)benzamides on positive allosteric modulation of the metabotropic glutamate-5 receptor in rat cortical astrocytes. J Med Chem 49:3332-44 (2006)  
Target
Name:
Metabotropic glutamate receptor 5
Synonyms:
GRM5_RAT Grm5 Mglur5 metabotropic glutamate 5/1-C metabotropic glutamate 5a
Type:
Enzyme
Mol. Mass.:
131900.14
Organism:
Rattus norvegicus (Rat)
Description:
P31424
Residue:
1203
  
Inhibitor
Name:
BDBM50187625
Synonyms:
4-nitro-N-(1-(2-chlorophenyl)-3-phenyl-1H-pyrazol-5-yl)benzamide | CHEMBL207334
Type:
Small organic molecule
Emp. Form.:
C22H15ClN4O3
Mol. Mass.:
418.833
SMILES:
[O-][N+](=O)c1ccc(cc1)C(=O)Nc1cc(nn1-c1ccccc1Cl)-c1ccccc1
: