Target
Calcium/calmodulin-dependent protein kinase type II subunit alpha
Ligand
BDBM50605605
Substrate
Meas. Tech.
ChEMBL_2252268 (CHEMBL5166478)
Ki
70±n/a nM
Citation
 Tian, YShehata, MAGauger, SJNg, CKLSolbak, SThiesen, LBruus-Jensen, JKrall, JBundgaard, CGibson, KMWellendorph, PFrĝlund, B Discovery and Optimization of 5-Hydroxy-Diclofenac toward a New Class of Ligands with Nanomolar Affinity for the CaMKII? Hub Domain. J Med Chem 65:6656-6676 (2022) Target
Name:
Calcium/calmodulin-dependent protein kinase type II subunit alpha
Synonyms:
CaM Kinase II Camk2a calcium/calmodulin-dependent protein kinase II alpha subunit
Type:
Enzyme Mixture
Mol. Mass.:
54120.65
Organism:
Rattus norvegicus (rat)
Description:
Consists of subunits of M.W. 50,000 and 58,000-60,000 in a 3:1 ratio.
Residue:
478
  
Inhibitor
Name:
BDBM50605605
Synonyms:
CHEMBL5198167
Type:
Small organic molecule
Emp. Form.:
C14H11ClN4O2
Mol. Mass.:
302.716
SMILES:
Oc1ccc(Oc2ccccc2Cl)c(Cc2nnn[nH]2)c1
: