Target
Thyroid hormone receptor alpha
Ligand
BDBM50605658
Substrate
Meas. Tech.
ChEMBL_2252577 (CHEMBL5166787)
EC50
18±n/a nM
Citation
 Li, QYao, BZhao, SLu, ZZhang, YXiang, QWu, XYu, HZhang, CLi, JZhuang, XWu, DLi, YXu, Y Discovery of a Highly Selective and H435R-Sensitive Thyroid Hormone Receptor ? Agonist. J Med Chem 65:7193-7211 (2022) Target
Name:
Thyroid hormone receptor alpha
Synonyms:
C-erbA-alpha EAR7 NR1A1 THA_HUMAN THRA1 Thyroid Hormone Receptor (TR-alpha) Thyroid hormone receptor alpha c-erbA-1
Type:
Receptor
Mol. Mass.:
54818.00
Organism:
Homo sapiens (Human)
Description:
Recombinant hThR was obtained from nuclear extracts from SF9 cells infected with baculovirus vectors encoding for ThRalpha 1.
Residue:
490
  
Inhibitor
Name:
BDBM50605658
Synonyms:
CHEMBL5188839
Type:
Small organic molecule
Emp. Form.:
C28H26N2O6
Mol. Mass.:
486.5158
SMILES:
COc1nc(C(=O)NCC(O)=O)c(O)c2ccc(Oc3c(C)cc(Cc4ccccc4)cc3C)cc12
: