Target
Sodium- and chloride-dependent glycine transporter 1
Ligand
BDBM50188372
Substrate
Meas. Tech.
ChEMBL_378748 (CHEMBL871493)
EC50
2638±n/a nM
Citation
 Alberati, DHainzl, DJolidon, SKrafft, EAKurt, AMaier, APinard, EThomas, AWZimmerli, D Discovery of 4-substituted-8-(2-hydroxy-2-phenyl-cyclohexyl)-2,8-diaza-spiro[4.5]decan-1-one as a novel class of highly selective GlyT1 inhibitors with improved metabolic stability. Bioorg Med Chem Lett 16:4311-5 (2006)  
Target
Name:
Sodium- and chloride-dependent glycine transporter 1
Synonyms:
GlyT-1 Glycine Transporters (GlyT1c) SC6A9_HUMAN Sodium- and chloride-dependent glycine transporter 1 Sodium- and chloride-dependent glycine transporter 1 (GlyT1c) Solute carrier family 6 member 9
Type:
Enzyme
Mol. Mass.:
78270.54
Organism:
Homo sapiens (Human)
Description:
P48067
Residue:
706
  
Inhibitor
Name:
BDBM50188372
Synonyms:
4-(4-fluoro-phenyl)-8-(2-hydroxy-2-m-tolyl-cyclohexyl)-2,8-diaza-spiro[4.5]decan-1-one | CHEMBL214257
Type:
Small organic molecule
Emp. Form.:
C27H33FN2O2
Mol. Mass.:
436.5615
SMILES:
Cc1cccc(c1)C1(O)CCCCC1N1CCC2(CC1)C(CNC2=O)c1ccc(F)cc1
: