Target
Protein AF-9
Ligand
BDBM50606145
Substrate
Meas. Tech.
ChEMBL_2253822 (CHEMBL5168032)
Ki
29±n/a nM
Citation
 Yuan, YDu, LTan, RYu, YJiang, JYao, ALuo, JTang, RXiao, YSun, H Design, Synthesis, and Biological Evaluations of DOT1L Peptide Mimetics Targeting the Protein-Protein Interactions between DOT1L and MLL-AF9/MLL-ENL. J Med Chem 65:7770-7785 (2022) Target
Name:
Protein AF-9
Synonyms:
AF9 ALL1-fused gene from chromosome 9 protein Myeloid/lymphoid or mixed-lineage leukemia translocated to chromosome 3 protein YEATS domain-containing protein 3 | YEATS3
Type:
PROTEIN
Mol. Mass.:
63368.78
Organism:
Homo sapiens
Description:
ChEMBL_118006
Residue:
568
  
Inhibitor
Name:
BDBM50606145
Synonyms:
CHEMBL5190103
Type:
Small organic molecule
Emp. Form.:
C46H67N9O6
Mol. Mass.:
842.0809
SMILES:
CC(C)C[C@H](NC(C)=O)C(=O)N1CCC[C@H]1C(=O)N[C@@H](C(C)C)C(=O)N[C@@H](CN)C(=O)N[C@@H](CC1CCCC1)C(=O)N[C@@H](C(C)C)c1nc2cccc(-c3ccccc3)c2[nH]1
: