Target
Fibroblast growth factor receptor 4
Ligand
BDBM50606156
Substrate
Meas. Tech.
ChEMBL_2253894 (CHEMBL5168104)
IC50
0.700000±n/a nM
Citation
 Zhang, XWang, YJi, JSi, DBao, XYu, ZZhu, YZhao, LLi, WLiu, J Discovery of 1,6-Naphthyridin-2(1 J Med Chem 65:7595-7618 (2022) Target
Name:
Fibroblast growth factor receptor 4
Synonyms:
CD_antigen: CD334 FGFR4 FGFR4 Fibroblast growth factor receptor JK2 TKF
Type:
Protein
Mol. Mass.:
87957.45
Organism:
Homo sapiens (Human)
Description:
P22455
Residue:
802
  
Inhibitor
Name:
BDBM50606156
Synonyms:
CHEMBL5202677
Type:
Small organic molecule
Emp. Form.:
C28H26Cl2N4O5
Mol. Mass.:
569.436
SMILES:
CCn1c2cc(Nc3c(NC(=O)C=C)cccc3OC)ncc2cc(-c2c(Cl)c(OC)cc(OC)c2Cl)c1=O
: