Target
Fibroblast growth factor receptor 4
Ligand
BDBM50606159
Substrate
Meas. Tech.
ChEMBL_2253894 (CHEMBL5168104)
IC50
0.700000±n/a nM
Citation
 Zhang, XWang, YJi, JSi, DBao, XYu, ZZhu, YZhao, LLi, WLiu, J Discovery of 1,6-Naphthyridin-2(1 J Med Chem 65:7595-7618 (2022) Target
Name:
Fibroblast growth factor receptor 4
Synonyms:
CD_antigen: CD334 FGFR4 FGFR4 Fibroblast growth factor receptor JK2 TKF
Type:
Protein
Mol. Mass.:
87957.45
Organism:
Homo sapiens (Human)
Description:
P22455
Residue:
802
  
Inhibitor
Name:
BDBM50606159
Synonyms:
CHEMBL5186034
Type:
Small organic molecule
Emp. Form.:
C26H28Cl2N4O5
Mol. Mass.:
547.43
SMILES:
CCn1c2cc(N[C@@H]3COCC[C@@H]3NC(=O)C=C)ncc2cc(-c2c(Cl)c(OC)cc(OC)c2Cl)c1=O
: