Target
Fibroblast growth factor receptor 4
Ligand
BDBM50593531
Substrate
Meas. Tech.
ChEMBL_2253975 (CHEMBL5168185)
IC50
0.470000±n/a nM
Citation
 Zhang, XWang, YJi, JSi, DBao, XYu, ZZhu, YZhao, LLi, WLiu, J Discovery of 1,6-Naphthyridin-2(1 J Med Chem 65:7595-7618 (2022) Target
Name:
Fibroblast growth factor receptor 4
Synonyms:
CD_antigen: CD334 FGFR4 FGFR4 Fibroblast growth factor receptor JK2 TKF
Type:
Protein
Mol. Mass.:
87957.45
Organism:
Homo sapiens (Human)
Description:
P22455
Residue:
802
  
Inhibitor
Name:
BDBM50593531
Synonyms:
ASP-5878 Asp 5878 Asp5878
Type:
Small organic molecule
Emp. Form.:
C18H19F2N5O4
Mol. Mass.:
407.3714
SMILES:
COc1cc(OC)c(F)c(COc2cnc(Nc3cnn(CCO)c3)nc2)c1F
: