Target
Histamine H1 receptor
Ligand
BDBM50606406
Substrate
Meas. Tech.
ChEMBL_2254793 (CHEMBL5169003)
Kd
4.0±n/a nM
Citation
 Kok, ZYStoddart, LAMistry, SJMocking, TAMVischer, HFLeurs, RHill, SJMistry, SNKellam, B Optimization of Peptide Linker-Based Fluorescent Ligands for the Histamine H J Med Chem 65:8258-8288 (2022) Target
Name:
Histamine H1 receptor
Synonyms:
H1R HISTAMINE H1 HRH1_HUMAN
Type:
G Protein-Coupled Receptor (GPCR)
Mol. Mass.:
55808.72
Organism:
Homo sapiens (Human)
Description:
Cell pellets from SK-N-MC cells transfected with human H1 receptor were used in binding assay.
Residue:
487
  
Inhibitor
Name:
BDBM50606406
Synonyms:
CHEMBL5184108
Type:
Small organic molecule
Emp. Form.:
C65H78BF2N11O11S
Mol. Mass.:
1270.255
SMILES:
CC(C)[C@H](NC(=O)CCN1CCC(CC1)Oc1ccccc1Cc1ccccc1)C(=O)N[C@@H](CO)C(=O)N[C@@H](CC(N)=O)C(=O)NCCC(=O)N[C@@H](CCCCNC(=O)COc1ccc(\C=C\C2=[N+]3C(C=C2)=Cc2ccc(-c4cccs4)n2[B-]3(F)F)cc1)C(N)=O
: