Target
Melanocortin receptor 4
Ligand
BDBM50189014
Substrate
Meas. Tech.
ChEMBL_395997 (CHEMBL910342)
EC50
0.50±n/a nM
Citation
 Tian, XMishra, RKSwitzer, AGHu, XEKim, NMazur, AWEbetino, FHWos, JACrossdoersen, DPinney, BBFarmer, JASheldon, RJ Design and synthesis of potent and selective 1,3,4-trisubstituted-2-oxopiperazine based melanocortin-4 receptor agonists. Bioorg Med Chem Lett 16:4668-73 (2006)  
Target
Name:
Melanocortin receptor 4
Synonyms:
MC4-R MC4R_HUMAN Melanocortin receptor 4 (MC-4) Melanocortin receptor 4 (MC4R)
Type:
Enzyme
Mol. Mass.:
36949.50
Organism:
Homo sapiens (Human)
Description:
P32245
Residue:
332
  
Inhibitor
Name:
BDBM50189014
Synonyms:
(S)-2-((S)-4-((R)-2-acetamido-3-(4-fluorophenyl)propanoyl)-3-(3-guanidinopropyl)-2-oxopiperazin-1-yl)-N-methyl-3-(naphthalen-2-yl)propanamide | CHEMBL384176
Type:
Small organic molecule
Emp. Form.:
C33H40FN7O4
Mol. Mass.:
617.7136
SMILES:
CNC(=O)[C@H](Cc1ccc2ccccc2c1)N1CCN([C@@H](CCCNC(N)=N)C1=O)C(=O)[C@@H](Cc1ccc(F)cc1)NC(C)=O
: