Target
Alpha-ketoglutarate-dependent dioxygenase FTO
Ligand
BDBM50328019
Substrate
Meas. Tech.
ChEMBL_2261090 (CHEMBL5216101)
IC50
15000±n/a nM
Citation
 Shishodia, SDemetriades, MZhang, DTam, NYMaheswaran, PClunie-O'Connor, CTumber, ALeung, IKHNg, YMLeissing, TMEl-Sagheer, AHSalah, EBrown, TAik, WSMcDonough, MASchofield, CJ Structure-Based Design of Selective Fat Mass and Obesity Associated Protein (FTO) Inhibitors. J Med Chem 64:16609-16625 (2021) Target
Name:
Alpha-ketoglutarate-dependent dioxygenase FTO
Synonyms:
FTO Fat mass and obesity-associated protein | KIAA1752
Type:
PROTEIN
Mol. Mass.:
58263.75
Organism:
Homo sapiens (Human)
Description:
ChEMBL_1515854
Residue:
505
  
Inhibitor
Name:
BDBM50328019
Synonyms:
2-(3-hydroxypicolinamido)acetic acid | CHEMBL1256568
Type:
Small organic molecule
Emp. Form.:
C8H8N2O4
Mol. Mass.:
196.1601
SMILES:
OC(=O)CNC(=O)c1ncccc1O
: