Target
Indoleamine 2,3-dioxygenase 1
Ligand
BDBM50402289
Substrate
Meas. Tech.
ChEMBL_2261538 (CHEMBL5216549)
IC50
>100000±n/a nM
Citation
 He, GWan, SWu, YChu, ZShen, HZhang, SChen, LBao, ZGu, SHuang, JHuang, LGong, GZou, YZhu, QXu, Y Discovery of the First Selective IDO2 Inhibitor As Novel Immunotherapeutic Avenues for Rheumatoid Arthritis. J Med Chem 65:14348-14365 (2022) Target
Name:
Indoleamine 2,3-dioxygenase 1
Synonyms:
I23O1_HUMAN IDO-1 INDO Indoleamine 2,3-dioxygenase | Indoleamine-pyrrole 2,3-dioxygenase
Type:
Enzyme
Mol. Mass.:
45330.80
Organism:
Homo sapiens (Human)
Description:
P14902
Residue:
403
  
Inhibitor
Name:
BDBM50402289
Synonyms:
TENATOPRAZOLE
Type:
Small organic molecule
Emp. Form.:
C16H18N4O3S
Mol. Mass.:
346.404
SMILES:
COc1ccc2[nH]c(nc2n1)S(=O)Cc1ncc(C)c(OC)c1C
: