Target
Indoleamine 2,3-dioxygenase 2
Ligand
BDBM50402289
Substrate
Meas. Tech.
ChEMBL_2261539 (CHEMBL5216550)
IC50
1800±n/a nM
Citation
 He, GWan, SWu, YChu, ZShen, HZhang, SChen, LBao, ZGu, SHuang, JHuang, LGong, GZou, YZhu, QXu, Y Discovery of the First Selective IDO2 Inhibitor As Novel Immunotherapeutic Avenues for Rheumatoid Arthritis. J Med Chem 65:14348-14365 (2022) Target
Name:
Indoleamine 2,3-dioxygenase 2
Synonyms:
I23O2_HUMAN IDO2 Indoleamine 2,3-dioxygenase-like protein 1 | Indoleamine-pyrrole 2,3-dioxygenase-like protein 1
Type:
PROTEIN
Mol. Mass.:
47079.13
Organism:
Homo sapiens (Human)
Description:
ChEMBL_109909
Residue:
420
  
Inhibitor
Name:
BDBM50402289
Synonyms:
TENATOPRAZOLE
Type:
Small organic molecule
Emp. Form.:
C16H18N4O3S
Mol. Mass.:
346.404
SMILES:
COc1ccc2[nH]c(nc2n1)S(=O)Cc1ncc(C)c(OC)c1C
: