Target
Potassium voltage-gated channel subfamily H member 2
Ligand
BDBM50190300
Substrate
Meas. Tech.
ChEMBL_405656 (CHEMBL869869)
IC50
170±n/a nM
Citation
 Rowbottom, MWVickers, TDDyck, BGrey, JTamiya, JZhang, MKiankarimi, MWu, DDwight, WWade, WSSchwarz, DHeise, CEMadan, AFisher, APetroski, RGoodfellow, VS Synthesis and structure-activity relationships of retro bis-aminopyrrolidine urea (rAPU) derived small-molecule antagonists of the melanin-concentrating hormone receptor-1 (MCH-R1). Part 1. Bioorg Med Chem Lett 16:4450-7 (2006)  
Target
Name:
Potassium voltage-gated channel subfamily H member 2
Synonyms:
1,3-beta-glucan synthase component GLS2 ERG Eag-related protein 1 Ether-a-go-go-related gene (HERG) Ether-a-go-go-related gene potassium channel 1 Ether-a-go-go-related gene potassium channel 1 (hERG1) Ether-a-go-go-related protein 1 H-ERG KCNH2 Potassium voltage-gated channel subfamily H member 2 (hERG) Voltage-gated potassium channel subunit Kv11.1 hERG Potassium Channel 1 | putative potassium channel subunit
Type:
Multi-pass membrane protein
Mol. Mass.:
126672.65
Organism:
Homo sapiens (Human)
Description:
Q12809
Residue:
1159
  
Inhibitor
Name:
BDBM50190300
Synonyms:
(S)-3-[methyl-(4'-trifluoromethyl-biphenyl-4-carbonyl)-amino]-pyrrolidine-1-carboxylic acid {(R)-1-[3-(4-chloro-phenyl)-propyl]-pyrrolidin-3-yl}-methyl-amide | CHEMBL375330
Type:
Small organic molecule
Emp. Form.:
C34H38ClF3N4O2
Mol. Mass.:
627.139
SMILES:
CN([C@@H]1CCN(CCCc2ccc(Cl)cc2)C1)C(=O)N1CC[C@@H](C1)N(C)C(=O)c1ccc(cc1)-c1ccc(cc1)C(F)(F)F
: