Target
Dipeptidyl peptidase 4
Ligand
BDBM50607267
Substrate
Meas. Tech.
ChEMBL_2262448 (CHEMBL5217459)
IC50
0.140000±n/a nM
Citation
 Vivesh, naKaur, BJaglan, SRani, SBatra, YSingh, P Proline based rationally designed peptide esters against dipeptidyl peptidase-4: Highly potent anti-diabetic agents. Bioorg Med Chem Lett 76:0 (2022) Target
Name:
Dipeptidyl peptidase 4
Synonyms:
ADABP Adenosine deaminase complexing protein 2 CD_antigen=CD26 DPP4 DPPIV Dipeptidyl peptidase 4 (DPP IV) Dipeptidyl peptidase 4 (DPP4) Dipeptidyl peptidase 4 membrane form Dipeptidyl peptidase IV Dipeptidyl peptidase IV (DDP-IV) Dipeptidyl peptidase IV membrane form Dipeptidyl peptidase-IV (DPP-4) T-cell activation antigen CD26 | TP103
Type:
Enzyme
Mol. Mass.:
88271.01
Organism:
Homo sapiens (Human)
Description:
P27487
Residue:
766
  
Inhibitor
Name:
BDBM50607267
Synonyms:
CHEMBL5220613
Type:
Small organic molecule
Emp. Form.:
C26H43N3O9
Mol. Mass.:
541.6343
SMILES:
CCOC(=O)\C=C\OC(=O)[C@@H]1CCCN1C(=O)[C@H](CCCCNC(=O)OC(C)(C)C)NC(=O)OC(C)(C)C
: